﻿Participant,Group,mean_eo_all,mean_alpha_eo,mean_beta_eo,mean_delta_eo,mean_theta_eo,mean_gammalow_eo,mean_mu_eo,mean_gammahigh_eo,mean_alpha_ec,mean_beta_ec,mean_delta_ec,mean_theta_ec,mean_gammalow_ec,mean_mu_ec,mean_gammahigh_ec,mean_ec_all,Frontal_Alpha_EO,Frontal_Beta_EO,Frontal_Delta_EO,Frontal_Theta_EO,Frontal_GammaLow_EO,Frontal_Gamma40_50_EO,Frontal_Mu_EO,CenPar_alpha_EO,CenPar_beta_EO,CenPar_delta_EO,CenPar_theta_EO,CenPar_gammaLow_EO,CenPar_gammaHigh_EO,CenPar_mu_EO,Occip_alpha_EO,Occip_beta_EO,Occip_delta_EO,Occip_theta_EO,Occip_gammaLow_EO,Occip_gammaHigh_EO,Occip_mu_EO,Frontal_Alpha_ec,Frontal_Beta_ec,Frontal_Delta_ec,Frontal_Theta_ec,Frontal_GammaLow_ec,Frontal_Gamma40_50_ec,Frontal_Mu_ec,Frontal_ALL_ec,CenPar_alpha_ec,CenPar_beta_ec,CenPar_delta_ec,CenPar_theta_ec,CenPar_gammaLow_ec,CenPar_gammaHigh_ec,CenPar_mu_ec,Occip_alpha_ec,Occip_beta_ec,Occip_delta_ec,Occip_theta_ec,Occip_gammaLow_ec,Occip_gammaHigh_ec,Occip_mu_ec,age,gen,hand,nat,lan,ADC_Score,ASRS_Score,TestingLocation,MABC2,DiffScoreWholeAlpha,DiffScoreFronBeta,DiffScoreOccBeta,DiffScoreOccHiGamma
11,4,8.381618738,5.516660603,3.772280966,21.31328662,9.553997724,4.004430121,5.880305741,4.476563207,6.041822931,3.888330431,14.62583857,8.004923155,3.486988914,6.268895534,3.4865705,8.140228772,6.839307435,4.006636348,32.55421391,12.07587917,5.508650348,5.777691913,7.67231987,3.538065217,2.630507217,10.49878996,6.218687043,2.220667391,3.068692783,3.571557087,6.50016225,5.314186875,19.5027955,10.31065213,4.018542625,3.995586375,6.4814695,4.911076783,3.568757391,20.57886743,8.415962087,4.106082652,4.324280783,5.312696739,9.368665924,4.863023174,3.142579,8.59285113,6.26624113,2.443434174,2.53983187,4.956468043,12.222407,6.251192375,14.87889175,10.51612463,4.192966875,3.231990875,12.38343488,21,0,1,3,1,81,52,1, ,-0.525162328,0.437878957,-0.9370055,0.7635955
12,3,8.315002906,17.2303616,8.468498379,11.82867197,7.67731731,4.668454931,16.59391043,2.980183931,25.41611052,8.180679259,14.31554916,8.782457983,4.653889034,24.16614514,2.658904448,14.17369923,5.798339522,3.487410696,7.78080813,4.556027783,2.416307478,1.652652826,5.634129913,17.51763043,8.650395522,10.66279135,7.101296391,4.408210478,2.672009304,16.7550717,44.69681275,15.92002825,21.96760375,14.90471013,8.794596875,5.245127,43.19868675,8.464151957,4.127911826,12.66432565,5.874711739,3.133880435,2.028459174,8.27044313,7.782775293,23.74990117,7.884865087,10.66862548,7.367581043,3.597949826,1.942978826,22.21330961,72.72123238,16.973452,23.28717225,17.620822,9.041345875,4.983877625,69.33189825,27,0,0,4,1,147,79,1, ,-8.185748914,-0.64050113,-1.05342375,0.261249375
14,4, , , , , , , , ,60.38715874,10.03648112,24.76945941,20.95237066,9.445358086,56.69147995,7.036030086,29.03636748, , , , , , , , , , , , , , , , , , , , , ,11.23380343,3.605053304,10.73221861,7.55774813,2.965923565,3.628430174,10.49998313,8.28220587,76.10584535,10.88609148,27.69418739,24.60930443,10.77491109,7.458155739,70.64890948,164.409214,26.382533,56.64226725,48.04171375,25.2310265,16.10714575,157.3136176,20,0,0,0,0,63,45,1, , , , , 
15,2,5.055245254,4.065638914,2.40056981,11.9084695,7.107354672,2.658668897,4.260915707,4.05337681,3.99332131,2.668587552,11.63861402,7.336976603,2.541891103,4.017274431,3.82564919,6.409374871,2.862641348,1.594303391,10.41701452,5.040290043,2.046865739,4.13695013,3.01996587,4.077658043,2.292187043,9.632218913,6.75515487,2.28228013,3.486234174,4.22738513,6.592149,4.461708875,20.15928388,12.21042338,5.041175875,5.04718975,7.034384125,3.133380348,2.009957652,9.931303652,6.823414609,2.420553,4.185790739,3.316755826,5.474514065,4.003956217,2.604177609,10.91904565,6.648023696,2.220141174,3.356164348,3.935778,5.853339,4.161741375,17.258006,9.750604875,3.530273375,3.926558625,5.726662,21,1,1,0,0,119,48,1, ,0.072317603,-0.415654261,0.2999675,1.120631125
16,4,11.05860137,11.96264322,7.010105724,26.75132855,14.62268529,5.577677345,11.64507188,5.677662052,25.90319036,9.933062741,34.24989566,20.40929398,7.737708948,25.10793259,6.785611672,22.62386069,6.519295217,4.41456187,23.79862765,9.897263696,3.999251348,5.177950609,6.47681813,12.99813574,6.96236713,19.81942478,13.75430613,4.905750783,4.966742217,12.39719378,24.48687388,13.85169138,56.571067,29.33795125,12.0497655,9.01102125,24.41931013,8.767792957,5.106927,28.34381709,12.71348009,5.479827348,5.940335348,9.108622174,13.73300428,26.26389878,10.0760013,25.78840817,18.76588591,6.303454435,5.715012565,24.80718604,76.30898838,22.53633013,73.49168638,44.74110388,18.148663,11.96298313,74.26539813,19,0,1,5,0,84,54,1, ,-13.94054714,-0.69236513,-8.68463875,-2.951961875
17,4,5.497079043,5.356095966,4.27819531,12.0736295,5.684839379,3.671805948,5.454286672,3.992691293,12.25950817,5.523418086,21.56874867,10.11170964,5.148699172,12.68259152,4.386152207,12.36584614,4.70354487,4.734630739,14.36052891,5.745495435,4.470515652,4.850617826,4.950138957,4.634661304,3.234944087,7.909058783,4.359107957,2.486494043,3.060328826,4.614476957,8.69219075,5.996010375,15.78224925,8.625333875,4.831459125,4.2899515,8.755759,8.265638522,4.864956043,31.61699909,11.12186678,6.217936391,5.227979174,9.012359652,13.96736511,9.613673696,4.478186478,10.70339513,6.84841687,3.209009565,3.199114304,9.732361522,29.7029355,9.968549625,22.82323613,15.20232413,7.27253875,5.186407875,30.02278125,29,0,1,6,1,73,52,1, ,-6.903412207,-0.130325304,-3.97253925,-0.896456375
19,4,7.374655031,8.562275259,6.482919931,14.55899841,8.082940276,4.333505,8.380702241,5.557365052,14.20803502,6.902130328,19.48585371,10.75612322,4.804793483,14.21835878,10.73273547,12.83803557,4.930575043,5.895435,10.20500517,6.067485696,4.132790696,5.740931826,5.07514213,8.853529652,6.037025,14.40623483,7.68998213,3.641567348,4.792227087,8.457786913,17.95027163,9.225071625,26.35927313,14.08567388,6.74318475,7.19314275,17.48151938,6.742139957,4.246257478,20.54081052,9.175741217,4.356191304,10.85196057,7.188894348,10.17623729,14.2287717,7.29459013,15.96712204,9.872898826,4.363042783,10.23887609,14.07788687,35.683121,12.87187813,26.65468213,16.8855635,7.30379375,11.515902,35.0287345,19,0,1,7,0,82,49,1, ,-5.645759759,1.649177522,-3.6468065,-4.32275925
20,3,9.840108859,15.37886498,11.49452879,18.84845938,10.22523522,5.337666293,14.74799507,5.044399759,62.76500864,17.20151224,31.49945486,17.307677,9.704422828,60.9989369,6.668884621,32.19341319,6.633499783,5.773732217,16.79005813,6.680242913,4.037945522,4.801872478,6.715166261,14.82777522,10.66497848,13.6788163,8.846709217,4.117754609,3.738069609,13.94879761,36.52388425,23.66417863,30.05546375,19.32069025,8.495289125,5.83309925,34.19338113,10.49493474,5.501120739,21.63582461,7.341933565,3.696338522,3.902410217,10.5993353,11.24345341,68.48772674, ,27.2828733,17.44488826,9.755667913,6.42929487,66.25371691, ,46.81452813,67.3931275,43.8623605,26.13591488,14.83357213, ,24,0,1,8,1,109,63,1, ,-47.38614366,0.272611478,-23.1503495,-9.000472875
21,1,6.020525172,5.988357103,6.272813448,13.08132557,7.001647362,3.998348741,5.885636741,2.36413369,7.975360431,6.060276379,22.61004867,11.38463783,4.28746131,8.115925224,2.375919414,12.00758083,4.273269,5.992807217,11.62894509,5.876777826,4.46641213,2.847246478,4.335877565,5.873343217,5.18071,10.98778643,6.381576348,2.913299739,1.527912435,5.693664087,9.9405355,8.25556,19.37942,10.07683025,4.753148,2.377773125,9.52221775,7.584369478,5.245927522,31.27028322,12.41577591,5.217210522,3.005754826,8.18326,14.12908903,6.827991261,5.568147739,13.10468374,8.566934696,3.001244783,1.577501478,6.647399478,11.67789638,8.739839375,23.50284788,14.90689225,4.930576625,2.566544625,11.49926325,19,0,0,0,0,88,64,1, ,-1.987003328,0.746879696,-0.484279375,-0.1887715
22,1,4.129522344,2.610773017,2.006414845,7.303469603,5.075425431,2.074717328,2.694736293,5.090630224,2.540844776,1.597670707,7.582903069,4.347113103,1.727180569,2.567920879,3.458997552,4.017132914,1.981568609,1.625804435,6.150236261,3.887568087,1.822814696,5.214291304,2.169903696,2.286555478,1.654176217,5.967711826,4.345656522,1.706642957,4.706710435,2.323344696,4.428998875,3.004824875,12.04540188,8.608361625,2.941197,4.8314665,4.313292625,1.94294713,1.208248435,7.403145913,3.414110087,1.489221304,3.370795478,2.029281739,3.492112891,2.163774609,1.358064522,5.590926,3.638656957,1.405578304,3.217731783,2.154068565,4.854957625,3.15948725,12.64583,7.896995875,3.03219725,4.183638625,4.842023875,35,0,1,0,0,99,57,1, ,0.069928241,0.417556,-0.154662375,0.647827875
23,1,4.95065275,5.392585517,4.005843224,9.345960707,5.392370983,2.654470914,5.345847052,4.344541793,59.6356384,9.450668586,23.12119252,15.68673972,8.595463672,59.06517864,7.251307259,26.97355981,3.409978174,2.771636087,8.395364696,4.222534565,2.407738957,4.400540348,3.532083087,6.088512522,3.948806478,8.456138217,5.207733043,2.484711304,4.112378391,6.01583087,8.10916625,6.886487875,13.22806675,8.010729625,3.477900125,4.501422375,7.809714,8.072707826,2.980383261,8.980070522,5.257094565,2.79071913,4.470807739,7.906673522,6.322564043,67.30099078,10.05047778,24.44903422,16.74324013,9.242965826,7.414004522,66.69422009, ,26.95936125,62.49555888,44.37933538,24.66271713,15.38357913, ,37,0,1,0,0,100,59,1, ,-54.24305288,-0.208747174,-20.07287338,-10.88215675
24,4,7.816538082,9.930414397,8.15037469,14.17007866,10.91993424,4.045513397,9.286213931,3.571286034,9.315773345,8.499955638,20.04044114,11.61706697,4.434736603,8.83937969,3.117176879,12.36830927,6.181746478,6.408478565,13.39543991,8.871353565,3.69177913,3.784555,5.896664348,11.19260252,8.021272261,12.26271017,10.03760661,3.545992087,2.954318652,10.450865,15.127937,11.79864625,18.56668738,16.33230188,5.587048125,3.95623325,13.88716775,8.129458783,7.292032478,27.37578313,10.73568865,4.907512478,3.576383304,8.167602826,13.38324076,8.406963261,7.891133696,12.2956703,9.449832478,3.244152435,2.302727522,7.759183348,13.58677238,12.35626738,20.22625325,18.02150963,6.020916,3.7399075,12.24925163,24,0,1,0,0,82,46,1, ,0.614641052,-0.883553913,-0.557621125,0.21632575
25,3,3.141565828,2.12936569,2.004086586,6.709595707,3.052562328,1.7191525,2.244556483,1.74669619,2.716912466,1.768527724,7.018710276,2.813744103,1.60505219,2.729443638,1.209394052,3.579473642,2.589088957,2.390368043,9.607496957,3.680167087,2.449164,2.398920087,2.901731652,1.351952217,1.228309739,3.468074348,1.916747304,0.866287652,1.00226413,1.337920174,3.081197625,3.157137375,7.93171175,4.51119525,2.23576275,2.171218,3.05576925,2.239803087,1.444843783,8.529531565,2.880402913,1.624389522,1.368577,2.33634913,3.773645337,2.388998565,1.555665478,4.462727696,2.040109913,1.198067304,0.878160043,2.336224739,4.644309125,2.981624625,8.800484875,4.352566125,2.472166,1.605703625,4.62672925,51,0,1,0,0,100,65,1, ,-0.587546776,0.945524261,0.17551275,0.565514375
26,1,5.414602289,7.040860586,3.865999,6.790754862,4.394392328,3.016225121,7.053131983,4.879946845,25.90155821,5.265680276,9.699317948,10.42185847,4.17600881,23.19093793,5.371184845,12.82210372,3.984159783,3.947051609,5.77231513,3.71071113,2.989389609,5.252535217,4.094693174,8.100275652,2.619834174,5.940929957,3.842465,2.326155652,4.222219261,8.025402261,11.91041363,4.529029375,9.476954375,6.17953225,3.48325975,4.324372625,11.80064538,8.364714609,3.735608652,6.708676609,5.736544522,2.948470478,5.154307522,7.603472348,6.136386098,33.223957,5.090355174,9.77808713,11.44351235,4.325725609,5.21540587,29.60503165,57.996667,10.16629938,17.16257488,20.25175838,7.420531875,6.414278625,52.37790075,34,0,1,0,0,92,64,1, ,-18.86069762,0.211442957,-5.63727,-2.089906
27,1,4.264630645,4.820286552,4.615372103,7.78801181,4.671543983,2.723788362,4.739058448,2.608650517,8.049236017,5.96678031,9.129629,5.292948948,2.955533483,7.496953034,2.558377345,7.109648569,2.973497783,3.33499487,6.360419348,3.542456478,2.218512826,2.657824261,3.044801652,4.85947113,4.459651391,7.144195391,4.328509,2.509657913,2.273248652,4.720448217,8.72157625,7.425234125,11.64034438,7.552098625,3.980746125,2.92969525,8.414721,4.306369522,3.941827087,8.437680522,4.167589,2.495956087,2.505157391,4.224104087,5.213366533,8.041166957,5.779795913,7.664820478,4.674184826,2.573041522,2.228262565,7.363752609,16.90121563,11.021391,13.0895665,8.83795725,4.68930125,3.296389,15.5042625,26,0,1,0,0,105,78,1, ,-3.228949466,-0.606832217,-3.596156875,-0.36669375
28,4,9.141855871,12.89268066,7.696591483,20.65641776,12.24145498,5.321774155,12.85660669,5.877244345,14.74139831,7.898431655,22.66418728,15.57353816,5.339635466,14.70503007,5.483035776,15.21938885,6.377276609,5.310247217,17.88989765,8.778305304,4.180723304,5.94574787,6.603243783,14.26731822,7.265113217,18.87080952,11.93933409,4.786901652,4.664604348,13.99526422,25.9983935,11.03442,30.10263075,20.0670575,8.03344225,6.25021125,25.8838005,7.980283478,5.793228348,20.09444465,13.5736383,4.821762261,5.809658,8.386691652,11.8603987,16.25152791,7.881146217,20.30804352,13.82195522,4.595209652,4.555509826,15.86942148,28.0431345,11.30867763,31.14045925,21.72681225,6.75144175,5.6644995,27.40131788,24,0,1,0,0,83,49,1, ,-1.848717655,-0.48298113,-0.274257625,0.58571175
29,4,13.00345342,20.82106483,6.296689931,22.43559634,19.73771922,6.168346103,19.19988498,6.545491431,29.97233757,7.083877759,22.31767336,22.50512798,6.86507119,25.51493621,6.769563741,20.46975417,9.236046957,3.739662826,14.1997503,11.24653557,3.616169609,5.543625217,8.622217696,26.70797404,6.769123391,21.99154961,21.9536063,6.592947522,6.417297826,24.18254487,33.33953013,9.162696875,28.64654075,29.63534513,8.507563875,7.03646475,30.85553113,15.27715565,4.444064043,20.85400457,15.97626996,4.810560391,6.338934478,12.928859,14.13787355,39.18288209,8.003739435,21.01634539,23.6076107,7.471536217,6.630303913,32.69722126,45.35910613,10.78332638,27.07774575,32.67031188,9.97616725,7.73228425,40.23175138,21,1,1,0,0,82,54,1, ,-9.151272741,-0.704401217,-1.6206295,-0.6958195
31,4,3.684193781,5.307113,3.229513276,9.262878983,4.955376362,2.31085431,5.260688655,2.253758828,11.86763928,4.436477379,12.05426728,5.874427741,2.889549034,11.25211009,2.837567862,8.558202918,2.924908696,1.607864696,7.556993043,3.470317696,1.478730043,1.813671348,2.964518391,5.47677413,3.365614043,8.324626435,4.742578043,2.271291609,2.088997087,5.42589087,10.66562175,7.08737725,15.45737763,9.031896125,4.597460375,3.776788375,10.4367905,4.482032522,2.418524565,11.45024174,4.730539348,2.527565652,2.681105435,4.516126652,5.770334543,13.37183335,4.580548957,9.965429609,5.365081217,2.509572522,2.457224174,12.56354013,28.52951838,9.629509,18.133783,9.722521625,4.7519885,4.203634125,26.50767125,21,0,0,9,1,56,47,1, ,-6.560526276,-0.81065987,-2.54213175,-0.42684575
35,4,8.119109203,8.853500086,6.271070897,19.93306883,12.38591874,4.854370897,8.859415276,5.623251517,18.87970836,6.842340138,21.07959198,14.43558845,5.290369793,18.85792881,5.347423759,15.30930723,5.971006826,4.124918174,19.36662196,9.27087287,4.416521609,5.531867043,6.260957435,8.615443174,5.792721478,16.3370263,11.38396496,3.770193348,4.545601391,8.493219652,16.16089375,12.51323875,29.11488763,21.54470338,7.92982125,7.99658275,15.82889438,6.634071565,3.821411043,17.3302727,9.100117,3.676127696,4.769072435,6.840124087,9.221468076,20.07720148,6.613566087,20.12004474,14.43343026,5.177759,4.999803913,20.08622783,50.94256688,15.41318925,33.1372,27.5629125,9.86171325,7.94848175,50.09732188,19,0,1,0,0,74,48,1, ,-10.02620828,0.30350713,-2.8999505,0.048101
36,4,5.689465051,5.143542724,3.7767475,13.92779098,7.532456931,3.417790828,5.323163741,6.657181328,6.201634121,4.221021172,23.85649021,9.1222765,4.091320931,6.391254362,6.3434715,10.8503555,4.12576113,3.146793087,12.6992187,6.40848287,3.199463217,6.795387783,4.392710522,5.004868348,3.438764739,12.08839178,7.012032826,3.095964043,6.221487696,5.16758487,7.441190875,5.05402575,19.94031213,10.42354413,4.090521875,6.77730575,7.4593035,5.802136,3.845503652,31.46245283,9.451554261,4.74808587,6.805892522,6.33279987,12.64041168,5.274136043,3.658740826,14.88240543,7.332653348,3.049741913,5.693683391,5.285918696,9.367780125,6.2113085,26.639134,11.7664525,4.7874635,6.779866,9.144657,22,0,1,0,0,59,42,1, ,-1.058091397,-0.698710565,-1.15728275,-0.00256025
37,4,13.29564655,16.160794,9.238894103,28.11015569,12.31939672,7.245128086,16.35423493,7.285667293,33.13706814,10.19482329,32.42162795,17.28842969,7.628343879,32.15465703,7.625344586,23.26048727,10.65492083,8.609018435,36.19546848,12.11344109,8.527401609,8.817099087,11.44053696,17.15241148,7.866601478,18.40703165,10.27487565,5.354402565,5.708645522,17.04459874,28.62266475,13.92162113,30.143361,17.18967438,8.650725,7.409621,28.03432438,12.08766287,5.37913487,34.93896135,13.71495587,6.066774087,7.546247478,12.36437922,16.53017874,41.41590461,11.36805652,25.49974396,16.43387178,7.424207957,7.072029391,39.99499217,70.9252785,20.04799538,45.72627825,29.08433063,12.48943188,9.56932425,67.87921188,20,0,0,9,1,50,45,1, ,-16.97627414,3.229883565,-6.12637425,-2.15970325
38,4,6.119924809,7.886629948,3.801178172,14.90556395,8.110396776,3.39954169,7.580752724,2.257394276,37.13664638,10.91136817,20.26761338,13.42832452,6.657941121,35.3152786,3.758890862,20.43598811,4.736791348,2.452697696,16.35371235,6.340892565,2.847381,2.056924217,4.791169478,8.582845087,3.784858478,11.68206596,7.64357213,3.149151913,2.066078348,8.241062696,15.34869175,7.6447355,18.869886,13.83102613,5.572472375,3.35237425,14.102625,8.855202696,3.17178013,14.47968204,7.186830174,2.888337652,1.912537087,8.844407217,8.423373761,46.97031248,12.95992448,20.42806143,14.6484873,7.633058261,4.228580913,44.58839022,98.89234313,29.2488095,38.15112438,28.03661375,15.7409825,8.292775625,92.90191513,21,0,1,7,1,82,56,1, ,-29.25001643,-0.719082435,-21.604074,-4.940401375
39,2,5.865560113,8.782513483,4.001777552,10.80691234,7.102021655,3.131859707,8.582474983,5.704122828,13.70328976,4.686318397,25.12661512,10.94841074,4.895733603,13.89816841,5.866769966,13.6161585,4.117125913,2.248334348,8.447627348,5.162158174,2.353114565,5.639667261,4.238460565,10.22628604,3.523590913,9.292997174,6.534172043,2.708036174,4.979136,9.939570435,16.152125,6.43599075,18.63788163,11.77869788,4.39703475,6.292626125,15.33855563,6.441972609,3.163713217,31.93579696,9.88609213,4.750005913,6.02324187,6.969879913,12.85689373,13.58674309,4.197759565,15.57935296,8.75741987,3.705645783,5.015563957,13.45934565,36.83103713,10.63657075,37.252166,20.867604,9.3747885,8.371609375,37.23446313,22,0,1,0,0,52,38,1, ,-4.920776276,-0.91537887,-4.20058,-2.07898325
40,1,6.539196371,14.67388416,4.832776776,10.09887203,6.228718914,3.062988862,14.36970066,3.147173207,33.30773536,6.917546414,14.93722362,10.52440319,5.25568231,32.90004576,4.311105862,16.42172715,3.174101913,2.61240687,6.059436565,3.464588609,1.872015261,2.710550391,3.143976261,13.61288622,4.308322174,9.381586783,5.61437187,2.706155522,2.763845739,13.30339013,52.53546763,11.88561588,23.12262838,15.50254313,7.15283325,4.91805825,51.44008113,6.299206522,2.235540739,7.113314609,4.185045261,2.018063,2.755430435,6.093595,4.958276783,31.71196543,6.670954,13.58982196,9.568110391,4.973388739,4.098175391,31.27840865,119.5223648,21.44610275,41.44065525,31.59270638,15.69380038,9.379992125,118.7739554,21,1,1,0,0,62,46,1, ,-18.63385121,0.37686613,-9.560486875,-4.461933875
41,4,7.446141484,13.06710257,4.932825362,13.65358929,8.431882448,3.674899655,13.02149002,3.347238052,23.07691597,6.540771241,20.56523407,10.43144072,4.904993224,22.81189924,3.969613759,15.1535905,4.928616043,3.03742513,12.11384039,6.615865043,2.717684478,2.911672826,4.941212348,15.12155135,4.945509652,11.76836122,7.687527609,3.396192565,3.123887391,15.01109213,31.495511,10.10553975,22.34387463,14.47192813,7.14233,5.263721,31.55144075,6.109479783,3.023874609,20.77264891,7.596950609,3.215645565,3.190286174,6.258324652,9.375738478,25.48719952,6.813893783,16.40905004,9.73407513,4.689739522,3.758171913,25.07647252,66.11627013,15.72219488,30.52379988,19.177073,10.27953475,6.831859625,65.15057713,22,1,1,0,0,81,49,1, ,-10.0098134,0.013550522,-5.616655125,-1.568138625
42,4, , , , , , , , ,31.95035062,7.748744345,19.15805072,11.97880267,6.500078379,32.59545024,4.615113293,17.70898709, , , , , , , , , , , , , , , , , , , , , ,7.927468522,4.438278087,14.09331222,5.608414783,3.281333174,2.811219522,8.193355043,8.016868402,35.03014491,7.199705304,16.16124687,11.72956613,6.184968957,4.378858652,35.54884152,94.07725813,18.26526225,41.06509588,30.23580113,16.60165913,10.46763888,96.34251988,43,1,1,0,0,48,29,1, , , , , 
44,4,19.74790281,36.82856538,8.40915169,31.14508193,17.66342484,7.000093948,34.61121679,3.757837534,75.34792576,13.84131007,66.34949281, ,15.55351633,69.96902519,8.277100362,51.03584344,51.79711443,12.00420087,49.35480191,25.30504326,10.15020896,5.481444696,48.48764222,25.91657561,5.644589304,17.57956517,11.40993804,4.490564261,2.392001304,24.30778304,22.39128013,5.225480375,14.12217163,10.64319963,4.370302375,2.27371975,21.66391763,108.9344828,19.96930057,107.5883331,70.52045817,23.55314987,12.65602087,101.5498677,76.75314367,51.63616704,9.59565787,39.25117409, ,10.29709848,5.420532261,47.8335583,42.172283,7.581988125,27.75448638,26.47451175,7.352517,3.753359875,38.32085838,23,0,1,12,1,57,16,2, ,-38.51936038,-7.965099696,-2.35650775,-1.479640125
45,4,5.969540539,7.213811534,3.894229948,12.08529719,4.910713828,2.613144121,6.970055534,1.944488259,19.35471683,6.917639672,15.31347897,7.42529369,4.181456397,18.90639043,2.647003793,12.25278229,11.91892217,6.142039652,22.18387265,8.469071652,4.247745043,2.805646826,11.47822839,3.919004174,2.114580261,4.90284413,2.316311739,1.354539,1.166600913,3.796065478,2.92043425,1.633357,3.269333875,1.77111475,1.018456625,1.0800905,2.821595875,30.96018809,10.94311013,28.01841213,12.14979387,6.945023043,4.113537348,30.41319387,20.51787605,10.68066143,3.888698652,6.212140478,3.940446348,2.13994113,1.535756217,10.33151739,10.10147838,3.538793625,5.386307625,3.550125375,2.04888375,1.4832075,9.76562675,30,0,0,0,0,50,22,2,55,-12.14090529,-4.801070478,-1.905436625,-0.403117
46,2,31.28474391,56.71172228,14.14470802,41.45144779,25.14712859,12.98150457,57.46574066,11.28643548,125.5469187,16.51003512,76.55286962,44.3692575, ,122.5323089,15.21656628, ,89.33963078,21.02863222,69.05119522,39.68245326,20.21935439,15.67624174,90.63062157,37.30982696,9.699318913,22.94240061,16.00228361,8.282097,8.251605565,37.78943887,20.33553775,5.959919625,15.2525715,9.400161,5.024140125,6.276566875,20.21307288, ,27.40609857,146.6982217,76.90303091, , , ,114.9806293,77.89534191,9.586494565,33.17622491,24.81733735,11.02711804,9.013289087,75.17013674,34.03203575,6.200491,14.77248925,12.34686438,5.6023835,6.842619625,31.95346975,33,0,0,1,1,143,55,2,0.5,-68.8351964,-6.377466348,-0.240571375,-0.56605275
49,2,14.37241006,19.80434617,4.747850914,29.99783128,13.16677253,5.416370983,19.72547147,3.316872241,79.97000712,12.90273453,41.56099602, ,12.51480872,70.92468024,7.910592241,45.40494772,32.87142787,7.80311613,57.81068526,23.62503648,9.801940783,5.757648217,33.07529383,10.40659539,2.095245957,9.177314087,5.029340522,1.937313174,1.276852217,10.1098917,10.14612425,3.7679165,11.53978038,7.064159,3.183686375,2.342820875,9.98582825,137.54722,20.96031535,73.02964896, ,21.29217961,12.07725048,120.6135602,78.7957116,40.76798557,6.793740826,15.46595757,21.13347226,5.456301957,3.305128826,36.48030696,33.221972,7.930546125,29.98069625,21.45449675,8.5529185,9.874968375,32.089169,24,1,0,1,1,113,47,2,0.1,-60.16566095,-13.15719922,-4.162629625,-7.5321475